{"text_format":"1","workbook":"xlsx","n_sheets":7,"sheets":["Configuració","Calendari anual","Calendari de curs","Calendari setmana completa","Calendari setmana laboral","Taules","Documentació"],"not_rendered":{"charts":0,"images":8,"macros":1,"external_links":0,"defined_names":36,"comments":0,"pivot_tables":0},"unopened":[],"bounds":{"document_bytes":16777216,"sheet_cells":100000,"rows_first":2000,"rows_last":500,"rows_between":2000,"halvings":0,"cell_chars":16384,"cell_head_chars":4096},"cells_cut":0,"cells_raw":0,"read":"whole","date_system":"1900"}

{"sheet":"Configuració","index":0,"n_rows":0,"n_cols":0,"rows_kept":0,"cut":false,"hidden":false,"merged":[]}

{"sheet":"Calendari anual","index":1,"n_rows":14,"n_cols":41,"rows_kept":14,"cut":false,"hidden":false,"merged":[]}
[]
[null,{"$f":"Any","v":2017},{"$f":"INDEX(rgDies,1,2)","v":"Dl"},{"$f":"INDEX(rgDies,2,2)","v":"Dt"},{"$f":"INDEX(rgDies,3,2)","v":"Dc"},{"$f":"INDEX(rgDies,4,2)","v":"Dj"},{"$f":"INDEX(rgDies,5,2)","v":"Dv"},{"$f":"INDEX(rgDies,6,2)","v":"Ds"},{"$f":"INDEX(rgDies,7,2)","v":"Dg"},{"$f":"INDEX(rgDies,1,2)","v":"Dl"},{"$f":"INDEX(rgDies,2,2)","v":"Dt"},{"$f":"INDEX(rgDies,3,2)","v":"Dc"},{"$f":"INDEX(rgDies,4,2)","v":"Dj"},{"$f":"INDEX(rgDies,5,2)","v":"Dv"},{"$f":"INDEX(rgDies,6,2)","v":"Ds"},{"$f":"INDEX(rgDies,7,2)","v":"Dg"},{"$f":"INDEX(rgDies,1,2)","v":"Dl"},{"$f":"INDEX(rgDies,2,2)","v":"Dt"},{"$f":"INDEX(rgDies,3,2)","v":"Dc"},{"$f":"INDEX(rgDies,4,2)","v":"Dj"},{"$f":"INDEX(rgDies,5,2)","v":"Dv"},{"$f":"INDEX(rgDies,6,2)","v":"Ds"},{"$f":"INDEX(rgDies,7,2)","v":"Dg"},{"$f":"INDEX(rgDies,1,2)","v":"Dl"},{"$f":"INDEX(rgDies,2,2)","v":"Dt"},{"$f":"INDEX(rgDies,3,2)","v":"Dc"},{"$f":"INDEX(rgDies,4,2)","v":"Dj"},{"$f":"INDEX(rgDies,5,2)","v":"Dv"},{"$f":"INDEX(rgDies,6,2)","v":"Ds"},{"$f":"INDEX(rgDies,7,2)","v":"Dg"},{"$f":"INDEX(rgDies,1,2)","v":"Dl"},{"$f":"INDEX(rgDies,2,2)","v":"Dt"},{"$f":"INDEX(rgDies,3,2)","v":"Dc"},{"$f":"INDEX(rgDies,4,2)","v":"Dj"},{"$f":"INDEX(rgDies,5,2)","v":"Dv"},{"$f":"INDEX(rgDies,6,2)","v":"Ds"},{"$f":"INDEX(rgDies,7,2)","v":"Dg"},{"$f":"INDEX(rgDies,1,2)","v":"Dl"},{"$f":"INDEX(rgDies,2,2)","v":"Dt"}]
[null,{"$f":"Taules!K3","v":"Gener"},{"$f":"IF(WEEKDAY(DATE(Any,AO3,1),2)=1,1,\"\")","v":""},{"$f":"IF(C3=\"\",IF(WEEKDAY(DATE(Any,AO3,1),2)=2,1,\"\"),C3+1)","v":""},{"$f":"IF(D3=\"\",IF(WEEKDAY(DATE(Any,AO3,1),2)=3,1,\"\"),D3+1)","v":""},{"$f":"IF(E3=\"\",IF(WEEKDAY(DATE(Any,AO3,1),2)=4,1,\"\"),E3+1)","v":""},{"$f":"IF(F3=\"\",IF(WEEKDAY(DATE(Any,AO3,1),2)=5,1,\"\"),F3+1)","v":""},{"$f":"IF(G3=\"\",IF(WEEKDAY(DATE(Any,AO3,1),2)=6,1,\"\"),G3+1)","v":""},{"$f":"IF(H3=\"\",IF(WEEKDAY(DATE(Any,AO3,1),2)=7,1,\"\"),H3+1)","v":1},{"$f":"I3+1","v":2},3,4,5,6,7,8,9,10,11,12,13,14,15,16,17,18,19,20,21,22,{"$f":"IF(MONTH(DATE(Any,AO3,AD3+1))=AO3,AD3+1,\"\")","v":23},{"$f":"IF(AE3=\"\",\"\",IF(MONTH(DATE(Any,AO3,AE3+1))=AO3,AE3+1,\"\"))","v":24},{"$f":"IF(AF3=\"\",\"\",IF(MONTH(DATE(Any,AO3,AF3+1))=AO3,AF3+1,\"\"))","v":25},{"$f":"IF(AG3=\"\",\"\",IF(MONTH(DATE(Any,AO3,AG3+1))=AO3,AG3+1,\"\"))","v":26},{"$f":"IF(AH3=\"\",\"\",IF(MONTH(DATE(Any,AO3,AH3+1))=AO3,AH3+1,\"\"))","v":27},{"$f":"IF(AI3=\"\",\"\",IF(MONTH(DATE(Any,AO3,AI3+1))=AO3,AI3+1,\"\"))","v":28},{"$f":"IF(AJ3=\"\",\"\",IF(MONTH(DATE(Any,AO3,AJ3+1))=AO3,AJ3+1,\"\"))","v":29},{"$f":"IF(AK3=\"\",\"\",IF(MONTH(DATE(Any,AO3,AK3+1))=AO3,AK3+1,\"\"))","v":30},{"$f":"IF(AL3=\"\",\"\",IF(MONTH(DATE(Any,AO3,AL3+1))=AO3,AL3+1,\"\"))","v":31},null,1]
[null,{"$f":"Taules!K4","v":"Febrer"},"","",1,2,3,4,5,6,7,8,9,10,11,12,13,14,15,16,17,18,19,20,21,22,23,24,25,26,27,28,"","","","","","","",null,2]
[null,{"$f":"Taules!K5","v":"Març"},"","",1,2,3,4,5,6,7,8,9,10,11,12,13,14,15,16,17,18,19,20,21,22,23,24,25,26,27,28,29,30,31,"","","","",null,3]
[null,{"$f":"Taules!K6","v":"Abril"},"","","","","",1,2,3,4,5,6,7,8,9,10,11,12,13,14,15,16,17,18,19,20,21,22,23,24,25,26,27,28,29,30,"","",null,4]
{"$rows_left_out":9}
{"sheet":"Calendari de curs","index":2,"n_rows":14,"n_cols":48,"rows_kept":14,"cut":false,"hidden":false,"merged":[]}
[]
[null,{"$f":"RIGHT(Any-1,2)&\"-\"&RIGHT(Any,2)","v":"16-17"},{"$f":"INDEX(rgDies,1,2)","v":"Dl"},{"$f":"INDEX(rgDies,2,2)","v":"Dt"},{"$f":"INDEX(rgDies,3,2)","v":"Dc"},{"$f":"INDEX(rgDies,4,2)","v":"Dj"},{"$f":"INDEX(rgDies,5,2)","v":"Dv"},{"$f":"INDEX(rgDies,6,2)","v":"Ds"},{"$f":"INDEX(rgDies,7,2)","v":"Dg"},{"$f":"INDEX(rgDies,1,2)","v":"Dl"},{"$f":"INDEX(rgDies,2,2)","v":"Dt"},{"$f":"INDEX(rgDies,3,2)","v":"Dc"},{"$f":"INDEX(rgDies,4,2)","v":"Dj"},{"$f":"INDEX(rgDies,5,2)","v":"Dv"},{"$f":"INDEX(rgDies,6,2)","v":"Ds"},{"$f":"INDEX(rgDies,7,2)","v":"Dg"},{"$f":"INDEX(rgDies,1,2)","v":"Dl"},{"$f":"INDEX(rgDies,2,2)","v":"Dt"},{"$f":"INDEX(rgDies,3,2)","v":"Dc"},{"$f":"INDEX(rgDies,4,2)","v":"Dj"},{"$f":"INDEX(rgDies,5,2)","v":"Dv"},{"$f":"INDEX(rgDies,6,2)","v":"Ds"},{"$f":"INDEX(rgDies,7,2)","v":"Dg"},{"$f":"INDEX(rgDies,1,2)","v":"Dl"},{"$f":"INDEX(rgDies,2,2)","v":"Dt"},{"$f":"INDEX(rgDies,3,2)","v":"Dc"},{"$f":"INDEX(rgDies,4,2)","v":"Dj"},{"$f":"INDEX(rgDies,5,2)","v":"Dv"},{"$f":"INDEX(rgDies,6,2)","v":"Ds"},{"$f":"INDEX(rgDies,7,2)","v":"Dg"},{"$f":"INDEX(rgDies,1,2)","v":"Dl"},{"$f":"INDEX(rgDies,2,2)","v":"Dt"},{"$f":"INDEX(rgDies,3,2)","v":"Dc"},{"$f":"INDEX(rgDies,4,2)","v":"Dj"},{"$f":"INDEX(rgDies,5,2)","v":"Dv"},{"$f":"INDEX(rgDies,6,2)","v":"Ds"},{"$f":"INDEX(rgDies,7,2)","v":"Dg"},{"$f":"INDEX(rgDies,1,2)","v":"Dl"},{"$f":"INDEX(rgDies,2,2)","v":"Dt"}]
[null,{"$f":"CHOOSE(AU3,Taules!K3,Taules!K4,Taules!K5,Taules!K6,Taules!K7,Taules!K8,Taules!K9,Taules!K10,Taules!K11,Taules!K12,Taules!K13,Taules!K14)","v":"Setembre"},{"$f":"IF(WEEKDAY(DATE(AV3,AU3,1),2)=1,1,\"\")","v":""},{"$f":"IF(C3=\"\",IF(WEEKDAY(DATE($AV3,$AU3,1),2)=2,1,\"\"),C3+1)","v":""},{"$f":"IF(D3=\"\",IF(WEEKDAY(DATE($AV3,$AU3,1),2)=3,1,\"\"),D3+1)","v":""},{"$f":"IF(E3=\"\",IF(WEEKDAY(DATE($AV3,$AU3,1),2)=4,1,\"\"),E3+1)","v":1},{"$f":"IF(F3=\"\",IF(WEEKDAY(DATE($AV3,$AU3,1),2)=5,1,\"\"),F3+1)","v":2},{"$f":"IF(G3=\"\",IF(WEEKDAY(DATE($AV3,$AU3,1),2)=6,1,\"\"),G3+1)","v":3},{"$f":"IF(H3=\"\",IF(WEEKDAY(DATE($AV3,$AU3,1),2)=7,1,\"\"),H3+1)","v":4},{"$f":"I3+1","v":5},6,7,8,9,10,11,12,13,14,15,16,17,18,19,20,21,22,23,24,25,{"$f":"IF(MONTH(DATE(AV3,AU3,AD3+1))=AU3,AD3+1,\"\")","v":26},{"$f":"IF(AE3=\"\",\"\",IF(MONTH(DATE(AV3,AU3,AE3+1))=AU3,AE3+1,\"\"))","v":27},{"$f":"IF(AF3=\"\",\"\",IF(MONTH(DATE(AV3,AU3,AF3+1))=AU3,AF3+1,\"\"))","v":28},{"$f":"IF(AG3=\"\",\"\",IF(MONTH(DATE(AV3,AU3,AG3+1))=AU3,AG3+1,\"\"))","v":29},{"$f":"IF(AH3=\"\",\"\",IF(MONTH(DATE(AV3,AU3,AH3+1))=AU3,AH3+1,\"\"))","v":30},{"$f":"IF(AI3=\"\",\"\",IF(MONTH(DATE(AV3,AU3,AI3+1))=AU3,AI3+1,\"\"))","v":""},{"$f":"IF(AJ3=\"\",\"\",IF(MONTH(DATE(AV3,AU3,AJ3+1))=AU3,AJ3+1,\"\"))","v":""},{"$f":"IF(AK3=\"\",\"\",IF(MONTH(DATE(AV3,AU3,AK3+1))=AU3,AK3+1,\"\"))","v":""},{"$f":"IF(AL3=\"\",\"\",IF(MONTH(DATE(AV3,AU3,AL3+1))=AU3,AL3+1,\"\"))","v":""},null,"Començar el:",null,null,null,null,null,{"$f":"Mes","v":9},{"$f":"2000+LEFT($B$2,2)","v":2016}]
[null,{"$f":"CHOOSE(AU4,Taules!K3,Taules!K4,Taules!K5,Taules!K6,Taules!K7,Taules!K8,Taules!K9,Taules!K10,Taules!K11,Taules!K12,Taules!K13,Taules!K14)","v":"Octubre"},"","","","","",1,2,{"$f":"I4+1","v":3},4,5,6,7,8,9,10,11,12,13,14,15,16,17,18,19,20,21,22,23,24,25,26,27,28,29,30,31,"",null,null,null,null,null,null,null,{"$f":"MOD(AU3,12)+1","v":10},{"$f":"IF(AU4>AU3,AV3,AV3+1)","v":2016}]
[null,{"$f":"CHOOSE(AU5,Taules!K3,Taules!K4,Taules!K5,Taules!K6,Taules!K7,Taules!K8,Taules!K9,Taules!K10,Taules!K11,Taules!K12,Taules!K13,Taules!K14)","v":"Novembre"},"",1,2,3,4,5,6,{"$f":"I5+1","v":7},8,9,10,11,12,13,14,15,16,17,18,19,20,21,22,23,24,25,26,27,28,29,30,"","","","","","",null,null,null,null,null,null,null,{"$f":"MOD(AU4,12)+1","v":11},{"$f":"IF(AU5>AU4,AV4,AV4+1)","v":2016}]
[null,{"$f":"CHOOSE(AU6,Taules!K3,Taules!K4,Taules!K5,Taules!K6,Taules!K7,Taules!K8,Taules!K9,Taules!K10,Taules!K11,Taules!K12,Taules!K13,Taules!K14)","v":"Desembre"},"","","",1,2,3,4,{"$f":"I6+1","v":5},6,7,8,9,10,11,12,13,14,15,16,17,18,19,20,21,22,23,24,25,26,27,28,29,30,31,"","","",null,null,null,null,null,null,null,{"$f":"MOD(AU5,12)+1","v":12},2016]
{"$rows_left_out":9}
{"sheet":"Calendari setmana completa","index":3,"n_rows":39,"n_cols":50,"rows_kept":39,"cut":false,"hidden":false,"merged":[[33,49,35,49],[33,42,35,42],[33,35,35,35],[33,28,35,28],[33,21,35,21],[33,14,35,14],[33,7,35,7],[38,43,40,49],[36,29,37,33],[36,34,37,35],[36,36,37,40],[36,41,37,42],[38,29,40,35],[38,36,40,42],[36,7,37,7],[36,14,37,14],[38,22,40,28],[33,43,35,48],[33,36,35,41],[33,29,35,34],[33,22,35,27],[23,1,25,6],[23,7,25,7],[23,8,25,13],[23,14,25,14],[23,15,25,20],[23,21,25,21],[38,8,40,13],[38,1,40,6],[38,14,40,14],[38,7,40,7],[33,15,35,20],[33,8,35,13],[33,1,35,6],[36,1,37,6],[28,15,30,20],[28,8,30,13],[28,1,30,6],[28,14,30,14],[28,7,30,7],[31,1,32,6],[31,7,32,7],[36,8,37,13],[38,15,40,21],[28,43,30,48],[28,36,30,41],[28,29,30,34],[28,22,30,27],[28,49,30,49],[28,42,30,42],[28,35,30,35],[28,28,30,28],[28,21,30,21],[23,22,25,27],[23,28,25,28],[23,29,25,34],[1,8,8,42],[26,8,27,13],[21,36,22,41],[11,35,12,35],[11,29,12,34],[16,29,17,34],[16,35,17,35],[21,14,22,14],[21,8,22,13],[21,21,22,21],[21,15,22,20],[26,22,27,27],[26,15,27,20],[26,28,27,28],[26,21,27,21],[23,36,25,41],[23,42,25,42],[26,43,27,48],[10,29,10,35],[10,36,10,42],[10,43,10,49],[16,42,17,42],[16,36,17,41],[21,29,22,34],[21,42,22,42],[13,49,15,49],[26,35,27,35],[21,35,22,35],[23,35,25,35],[18,43,20,48],[18,49,20,49],[23,43,25,48],[23,49,25,49],[31,49,32,49],[31,43,32,48],[31,28,32,28],[31,22,32,27],[31,35,32,35],[31,29,32,34],[11,8,12,13],[11,36,12,41],[31,42,32,42],[31,36,32,41],[31,14,32,14],[31,8,32,13],[31,21,32,21],[31,15,32,20],[16,21,17,21],[16,15,17,20],[26,42,27,42],[26,36,27,41],[16,8,17,13],[16,14,17,14],[16,22,17,27],[21,49,22,49],[21,43,22,48],[26,49,27,49],[21,1,22,6],[16,49,17,49],[16,43,17,48],[11,15,12,20],[11,21,12,21],[16,28,17,28],[13,15,15,20],[13,21,15,21],[13,22,15,27],[13,28,15,28],[13,29,15,34],[13,35,15,35],[13,36,15,41],[13,42,15,42],[13,43,15,48],[16,1,17,6],[16,7,17,7],[13,1,15,6],[13,7,15,7],[13,8,15,13],[13,14,15,14],[18,29,20,34],[18,35,20,35],[18,7,20,7],[10,1,10,7],[10,8,10,14],[10,15,10,21],[10,22,10,28],[11,42,12,42],[11,28,12,28],[11,22,12,27],[11,49,12,49],[11,43,12,48],[11,7,12,7],[11,1,12,6],[11,14,12,14],[1,1,1,7],[1,43,1,49],[36,43,37,47],[36,48,37,49],[36,15,37,19],[36,20,37,21],[36,22,37,26],[36,27,37,28],[26,1,27,6],[26,7,27,7],[21,7,22,7],[21,28,22,28],[21,22,22,27],[26,14,27,14],[26,29,27,34],[18,36,20,41],[18,42,20,42],[18,1,20,6],[18,8,20,13],[18,14,20,14],[18,15,20,20],[18,21,20,21],[18,22,20,27],[18,28,20,28]]}
[]
[null,{"$f":"INDEX(rgMesos,MesAnt)&\" - \"&AnyAnt","v":"Agost - 2017"},null,null,null,null,null,null,{"$f":"INDEX(rgMesos,Mes)& \" - \" & Any","v":"Setembre - 2017"},null,null,null,null,null,null,null,null,null,null,null,null,null,null,null,null,null,null,null,null,null,null,null,null,null,null,null,null,null,null,null,null,null,null,{"$f":"INDEX(rgMesos,MesSeg)&\" - \"&AnySeg","v":"Octubre - 2017"}]
[null,{"$f":"INDEX(rgDies,1,3)","v":"Dll"},{"$f":"INDEX(rgDies,2,3)","v":"Dmt"},{"$f":"INDEX(rgDies,3,3)","v":"Dmc"},{"$f":"INDEX(rgDies,4,3)","v":"Djs"},{"$f":"INDEX(rgDies,5,3)","v":"Dvd"},{"$f":"INDEX(rgDies,6,3)","v":"Dss"},{"$f":"INDEX(rgDies,7,3)","v":"Dmg"},null,null,null,null,null,null,null,null,null,null,null,null,null,null,null,null,null,null,null,null,null,null,null,null,null,null,null,null,null,null,null,null,null,null,null,{"$f":"INDEX(rgDies,1,3)","v":"Dll"},{"$f":"INDEX(rgDies,2,3)","v":"Dmt"},{"$f":"INDEX(rgDies,3,3)","v":"Dmc"},{"$f":"INDEX(rgDies,4,3)","v":"Djs"},{"$f":"INDEX(rgDies,5,3)","v":"Dvd"},{"$f":"INDEX(rgDies,6,3)","v":"Dss"},{"$f":"INDEX(rgDies,7,3)","v":"Dmg"}]
[null,{"$f":"IF(WEEKDAY(DATE(AnyAnt,MesAnt,1),2)=1,1,\"\")","v":""},{"$f":"IF(B4=\"\",IF(WEEKDAY(DATE(AnyAnt,MesAnt,1),2)=2,1,\"\"),B4+1)","v":1},{"$f":"IF(C4=\"\",IF(WEEKDAY(DATE(AnyAnt,MesAnt,1),2)=3,1,\"\"),C4+1)","v":2},{"$f":"IF(D4=\"\",IF(WEEKDAY(DATE(AnyAnt,MesAnt,1),2)=4,1,\"\"),D4+1)","v":3},{"$f":"IF(E4=\"\",IF(WEEKDAY(DATE(AnyAnt,MesAnt,1),2)=5,1,\"\"),E4+1)","v":4},{"$f":"IF(F4=\"\",IF(WEEKDAY(DATE(AnyAnt,MesAnt,1),2)=6,1,\"\"),F4+1)","v":5},{"$f":"IF(G4=\"\",IF(WEEKDAY(DATE(AnyAnt,MesAnt,1),2)=7,1,\"\"),G4+1)","v":6},null,null,null,null,null,null,null,null,null,null,null,null,null,null,null,null,null,null,null,null,null,null,null,null,null,null,null,null,null,null,null,null,null,null,null,{"$f":"IF(WEEKDAY(DATE(AnySeg,MesSeg,1),2)=1,1,\"\")","v":""},{"$f":"IF(AR4=\"\",IF(WEEKDAY(DATE(AnySeg,MesSeg,1),2)=2,1,\"\"),AR4+1)","v":""},{"$f":"IF(AS4=\"\",IF(WEEKDAY(DATE(AnySeg,MesSeg,1),2)=3,1,\"\"),AS4+1)","v":""},{"$f":"IF(AT4=\"\",IF(WEEKDAY(DATE(AnySeg,MesSeg,1),2)=4,1,\"\"),AT4+1)","v":""},{"$f":"IF(AU4=\"\",IF(WEEKDAY(DATE(AnySeg,MesSeg,1),2)=5,1,\"\"),AU4+1)","v":""},{"$f":"IF(AV4=\"\",IF(WEEKDAY(DATE(AnySeg,MesSeg,1),2)=6,1,\"\"),AV4+1)","v":""},{"$f":"IF(AW4=\"\",IF(WEEKDAY(DATE(AnySeg,MesSeg,1),2)=7,1,\"\"),AW4+1)","v":1}]
[null,{"$f":"H4+1","v":7},{"$f":"B5+1","v":8},9,10,11,12,13,null,null,null,null,null,null,null,null,null,null,null,null,null,null,null,null,null,null,null,null,null,null,null,null,null,null,null,null,null,null,null,null,null,null,null,{"$f":"AX4+1","v":2},{"$f":"AR5+1","v":3},4,5,6,7,8]
[null,{"$f":"H5+1","v":14},{"$f":"B6+1","v":15},16,17,18,19,20,null,null,null,null,null,null,null,null,null,null,null,null,null,null,null,null,null,null,null,null,null,null,null,null,null,null,null,null,null,null,null,null,null,null,null,{"$f":"AX5+1","v":9},{"$f":"AR6+1","v":10},11,12,13,14,15]
{"$rows_left_out":34}
{"sheet":"Calendari setmana laboral","index":4,"n_rows":39,"n_cols":50,"rows_kept":39,"cut":false,"hidden":false,"merged":[[38,22,40,28],[1,8,8,28],[1,1,1,7],[33,15,35,21],[38,1,40,7],[38,8,40,14],[38,15,40,21],[26,14,27,14],[23,1,25,7],[23,8,25,14],[26,1,27,6],[26,7,27,7],[16,7,17,7],[16,8,17,13],[21,1,22,6],[21,7,22,7],[36,14,37,14],[36,8,37,13],[36,7,37,7],[33,1,35,7],[33,8,35,14],[28,1,30,7],[28,8,30,14],[31,1,32,6],[36,1,37,6],[33,43,35,49],[33,29,35,35],[33,36,35,42],[28,36,30,42],[26,49,27,49],[26,43,27,48],[31,29,32,34],[36,48,37,49],[26,28,27,28],[26,21,27,21],[26,22,27,27],[31,42,32,42],[31,7,32,7],[26,8,27,13],[31,36,32,41],[31,14,32,14],[31,8,32,13],[26,36,27,41],[38,43,40,49],[36,29,37,33],[36,34,37,35],[36,36,37,40],[36,41,37,42],[38,29,40,35],[38,36,40,42],[36,43,37,47],[1,29,1,35],[28,43,30,49],[26,29,27,34],[26,35,27,35],[21,42,22,42],[23,36,25,42],[11,36,12,41],[26,42,27,42],[23,43,25,49],[11,49,12,49],[28,29,30,35],[21,43,22,48],[18,29,20,35],[23,29,25,35],[10,43,10,49],[10,36,10,42],[23,15,25,21],[23,22,25,28],[26,15,27,20],[36,15,37,19],[36,20,37,21],[36,22,37,26],[36,27,37,28],[28,15,30,21],[28,22,30,28],[33,22,35,28],[31,21,32,21],[31,15,32,20],[18,36,20,42],[13,43,15,49],[16,43,17,48],[13,36,15,42],[21,28,22,28],[21,22,22,27],[21,36,22,41],[16,42,17,42],[16,36,17,41],[16,49,17,49],[18,1,20,7],[18,8,20,14],[18,15,20,21],[21,8,22,13],[21,21,22,21],[21,15,22,20],[21,14,22,14],[18,22,20,28],[10,1,10,7],[10,15,10,21],[10,22,10,28],[11,21,12,21],[16,28,17,28],[13,1,15,7],[13,8,15,14],[13,15,15,21],[11,15,12,20],[11,8,12,13],[16,22,17,27],[16,14,17,14],[16,21,17,21],[16,15,17,20],[13,22,15,28],[10,29,10,35],[11,42,12,42],[31,49,32,49],[31,43,32,48],[31,28,32,28],[31,22,32,27],[31,35,32,35],[11,14,12,14],[11,1,12,6],[16,1,17,6],[16,29,17,34],[11,7,12,7],[13,29,15,35],[11,28,12,28],[11,22,12,27],[11,35,12,35],[11,29,12,34],[10,8,10,14],[21,35,22,35],[21,29,22,34],[16,35,17,35],[11,43,12,48],[18,43,20,49],[21,49,22,49]]}
[]
[null,{"$f":"INDEX(rgMesos,MesAnt)&\" - \"&AnyAnt","v":"Agost - 2017"},null,null,null,null,null,null,{"$f":"INDEX(rgMesos,Mes)& \" - \" & Any","v":"Setembre - 2017"},null,null,null,null,null,null,null,null,null,null,null,null,null,null,null,null,null,null,null,null,{"$f":"INDEX(rgMesos,MesSeg)&\" - \"&AnySeg","v":"Octubre - 2017"}]
[null,{"$f":"INDEX(rgDies,1,3)","v":"Dll"},{"$f":"INDEX(rgDies,2,3)","v":"Dmt"},{"$f":"INDEX(rgDies,3,3)","v":"Dmc"},{"$f":"INDEX(rgDies,4,3)","v":"Djs"},{"$f":"INDEX(rgDies,5,3)","v":"Dvd"},{"$f":"INDEX(rgDies,6,3)","v":"Dss"},{"$f":"INDEX(rgDies,7,3)","v":"Dmg"},null,null,null,null,null,null,null,null,null,null,null,null,null,null,null,null,null,null,null,null,null,{"$f":"INDEX(rgDies,1,3)","v":"Dll"},{"$f":"INDEX(rgDies,2,3)","v":"Dmt"},{"$f":"INDEX(rgDies,3,3)","v":"Dmc"},{"$f":"INDEX(rgDies,4,3)","v":"Djs"},{"$f":"INDEX(rgDies,5,3)","v":"Dvd"},{"$f":"INDEX(rgDies,6,3)","v":"Dss"},{"$f":"INDEX(rgDies,7,3)","v":"Dmg"}]
[null,{"$f":"IF(WEEKDAY(DATE(AnyAnt,MesAnt,1),2)=1,1,\"\")","v":""},{"$f":"IF(B4=\"\",IF(WEEKDAY(DATE(AnyAnt,MesAnt,1),2)=2,1,\"\"),B4+1)","v":1},{"$f":"IF(C4=\"\",IF(WEEKDAY(DATE(AnyAnt,MesAnt,1),2)=3,1,\"\"),C4+1)","v":2},{"$f":"IF(D4=\"\",IF(WEEKDAY(DATE(AnyAnt,MesAnt,1),2)=4,1,\"\"),D4+1)","v":3},{"$f":"IF(E4=\"\",IF(WEEKDAY(DATE(AnyAnt,MesAnt,1),2)=5,1,\"\"),E4+1)","v":4},{"$f":"IF(F4=\"\",IF(WEEKDAY(DATE(AnyAnt,MesAnt,1),2)=6,1,\"\"),F4+1)","v":5},{"$f":"IF(G4=\"\",IF(WEEKDAY(DATE(AnyAnt,MesAnt,1),2)=7,1,\"\"),G4+1)","v":6},null,null,null,null,null,null,null,null,null,null,null,null,null,null,null,null,null,null,null,null,null,{"$f":"IF(WEEKDAY(DATE(AnySeg,MesSeg,1),2)=1,1,\"\")","v":""},{"$f":"IF(AD4=\"\",IF(WEEKDAY(DATE(AnySeg,MesSeg,1),2)=2,1,\"\"),AD4+1)","v":""},{"$f":"IF(AE4=\"\",IF(WEEKDAY(DATE(AnySeg,MesSeg,1),2)=3,1,\"\"),AE4+1)","v":""},{"$f":"IF(AF4=\"\",IF(WEEKDAY(DATE(AnySeg,MesSeg,1),2)=4,1,\"\"),AF4+1)","v":""},{"$f":"IF(AG4=\"\",IF(WEEKDAY(DATE(AnySeg,MesSeg,1),2)=5,1,\"\"),AG4+1)","v":""},{"$f":"IF(AH4=\"\",IF(WEEKDAY(DATE(AnySeg,MesSeg,1),2)=6,1,\"\"),AH4+1)","v":""},{"$f":"IF(AI4=\"\",IF(WEEKDAY(DATE(AnySeg,MesSeg,1),2)=7,1,\"\"),AI4+1)","v":1}]
[null,{"$f":"H4+1","v":7},{"$f":"B5+1","v":8},9,10,11,12,13,null,null,null,null,null,null,null,null,null,null,null,null,null,null,null,null,null,null,null,null,null,{"$f":"AJ4+1","v":2},{"$f":"AD5+1","v":3},4,5,6,7,8]
[null,{"$f":"H5+1","v":14},15,16,17,18,19,20,null,null,null,null,null,null,null,null,null,null,null,null,null,null,null,null,null,null,null,null,null,{"$f":"AJ5+1","v":9},10,11,12,13,14,15]
{"$rows_left_out":34}
{"sheet":"Taules","index":5,"n_rows":3002,"n_cols":21,"rows_kept":3002,"cut":false,"hidden":false,"merged":[[2,17,13,17],[14,17,29,17],[27,2,27,3],[28,2,28,3],[29,2,29,3],[20,1,20,2],[22,1,22,2],[23,2,23,3],[24,2,24,3],[32,2,32,3],[31,2,31,3],[33,2,33,3],[34,2,34,3],[25,2,25,3],[26,2,26,3],[30,2,30,3]]}
[]
[null,null,null,null,null,null,null,null,"Anys",null,"Mesos",null,null,"Data","Títol del dia destacat en negreta a la primera línia","És festiu?","Nota de text en segona línia"]
[null,"Any",2017,null,null,null,null,null,1,null,{"$f":"CHOOSE(Idioma,\"Gener\",\"Enero\",\"January\",\"Janvier\",\"Januar\")","v":"Gener"},null,1,"1/1","Cap d'Any",null,"Vacances de Nadal","Festes Fixes"]
[null,"Mes",9,null,null,null,null,null,2,null,{"$f":"CHOOSE(Idioma,\"Febrer\",\"Febrero\",\"February\",\"Février\",\"Februar\")","v":"Febrer"},null,2,"6/1","Reis",null,"Vacances de Nadal"]
[null,"AnyAnt",{"$f":"IF(Mes=1,Any-1,Any)","v":2017},null,null,null,null,null,3,null,{"$f":"CHOOSE(Idioma,\"Març\",\"Marzo\",\"March\",\"Mars\",\"März\")","v":"Març"},null,3,"1/5","Festa del Treball"]
[null,"MesAnt",{"$f":"IF(Mes=1,12,Mes-1)","v":8},null,null,null,null,null,4,null,{"$f":"CHOOSE(Idioma,\"Abril\",\"Abril\",\"April\",\"Avril\",\"April\")","v":"Abril"},null,4,"24/6","Sant Joan"]
{"$rows_left_out":2997}
{"sheet":"Documentació","index":6,"n_rows":133,"n_cols":21,"rows_kept":133,"cut":false,"hidden":false,"merged":[[46,7,47,8],[44,5,45,6],[42,3,43,4],[42,5,43,6],[42,7,43,8],[36,13,37,14],[38,1,39,2],[38,3,39,4],[38,5,39,6],[38,7,39,8],[38,9,39,10],[38,11,39,12],[38,13,39,14],[36,1,37,2],[36,11,37,12],[3,2,20,49],[1,1,1,18],[33,1,33,18],[62,1,63,4],[24,2,24,9],[26,2,26,9],[33,20,33,50],[44,9,45,10],[44,11,45,12],[44,13,45,14],[46,9,47,10],[46,11,47,12],[46,13,47,14],[44,7,45,8],[44,1,45,2],[36,9,37,10],[36,3,37,4],[36,5,37,6],[36,7,37,8],[44,3,45,4],[40,11,41,12],[40,13,41,14],[42,9,43,10],[42,11,43,12],[42,17,43,18],[36,20,40,51],[42,20,46,51],[58,17,59,18],[58,20,62,51],[36,17,37,18],[48,17,49,18],[48,20,50,51],[52,17,53,18],[52,20,56,51],[79,9,80,10],[79,11,80,12],[79,13,80,14],[40,1,41,2],[40,3,41,4],[40,5,41,6],[40,7,41,8],[42,1,43,2],[75,1,76,2],[75,3,76,4],[75,5,76,6],[75,7,76,8],[46,1,47,2],[73,9,74,10],[66,1,70,14],[73,11,74,12],[73,13,74,14],[73,3,74,4],[73,5,74,6],[73,7,74,8],[42,13,43,14],[40,9,41,10],[46,3,47,4],[46,5,47,6],[81,3,82,4],[96,1,97,4],[24,10,24,19],[73,17,74,18],[73,20,77,51],[79,17,80,18],[79,20,81,51],[83,17,84,18],[83,20,85,51],[81,9,82,10],[81,11,82,12],[77,1,78,2],[77,3,78,4],[77,9,78,10],[77,11,78,12],[77,5,78,6],[77,7,78,8],[75,9,76,10],[75,11,76,12],[75,13,76,14],[73,1,74,2],[77,13,78,14],[79,5,80,6],[79,7,80,8],[110,1,111,2],[110,3,111,4],[110,5,111,6],[110,7,111,8],[112,1,113,2],[81,5,82,6],[81,7,82,8],[79,1,80,2],[79,3,80,4],[101,1,105,14],[108,1,109,2],[108,3,109,4],[108,5,109,6],[108,7,109,8],[108,9,109,10],[81,13,82,14],[83,1,84,2],[83,3,84,4],[83,5,84,6],[83,7,84,8],[83,9,84,10],[83,11,84,12],[83,13,84,14],[81,1,82,2],[132,1,133,4],[118,1,119,2],[118,3,119,4],[118,5,119,6],[118,7,119,8],[114,3,115,4],[114,5,115,6],[114,7,115,8],[112,3,113,4],[112,5,113,6],[112,7,113,8],[116,1,117,2],[116,3,117,4],[116,5,117,6],[116,7,117,8],[114,1,115,2],[116,9,117,10],[116,11,117,12],[116,13,117,14],[114,9,115,10],[108,17,109,18],[108,20,115,52],[118,9,119,10],[118,11,119,12],[118,13,119,14],[110,9,111,10],[110,11,111,12],[110,13,111,14],[112,9,113,10],[112,11,113,12],[108,11,109,12],[108,13,109,14],[114,11,115,12],[114,13,115,14],[112,13,113,14],[116,20,123,52]]}
[]
[null,"Generador de calendaris"]
[]
[null,null,"Aquest full de càlcul genera i imprimeix fulls mensuals de calendari per a qualsevol mes i any en el rang de dates vàlides de l'Excel. L'any màxim disponible a la llista desplegable del full Configuració és el 3000 però pot modificar-se fàcilment variant el rang anys ($I$3:$I$3002) en el full de taules.\n\nTambé pot mostrar, amb una trama de color i l'anotació escrita, els dies festius indicats en el rang festes a $N$3:$Q$373 en el full Taules. Aquestes festes poden modificar-se lliurement i treure'n o afegir-ne fins a tenir un màxim d'una per dia de l'any.\n\nS'utilitza una graella de sis setmanes, que és el màxim que un mes pot arribar a 'tocar' en el pitjor dels casos (de 31 dies començant en diumenge). La sisena setmana només fa servir els dos primers dies, quedant els cinc darrers permanentment inhabilitats.\n\nLa resta dels dies que poden ser inhabilitats o no en funció de l'any i mes a mostrar apareixen automàticament amb una trama grisa.\n\nEs basa en determinar en quin dia de la setmana comença el mes indicat. Després cal incrementar en 1 cada dia fins arribar al dilluns de\nla cinquena setmana que és el primer que pot no existir. A partir d'aquí es comprova per a cada dia si el mes ja s'ha acabat el dia anterior.\nEn cas negatiu es comprova si en incrementar en 1 el seu dia anterior encara estem en el mes indicat. Si és així es fa la suma, si no\nsignifica que l'anterior va ser el darrer dia del mes.\n\nEl càlcul de les fases lunars és només aproximat i sovint l'indicador apareixerà amb un desfase d'un dia de més o de menys.\n"]
[]
[]
{"$rows_left_out":127}